{"text_format":"1","workbook":"xlsx","n_sheets":7,"sheets":["MMES","Desechos","Desarrollo","Recomendacion","Ru","TIPO","Hoja1"],"not_rendered":{"charts":0,"images":0,"macros":0,"external_links":0,"defined_names":9,"comments":0,"pivot_tables":0},"unopened":[],"bounds":{"document_bytes":16777216,"sheet_cells":100000,"rows_first":2000,"rows_last":500,"rows_between":2000,"halvings":0,"cell_chars":16384,"cell_head_chars":4096},"cells_cut":0,"cells_raw":0,"read":"whole","date_system":"1900"}

{"sheet":"MMES","index":0,"n_rows":220,"n_cols":46,"rows_kept":220,"cut":false,"hidden":false,"merged":[[18,5,18,6],[18,15,18,16],[18,11,18,12],[18,13,18,14],[219,5,219,6],[10,3,10,27],[10,28,10,35],[12,3,12,35],[14,3,14,18],[14,19,14,35],[18,19,18,35],[18,3,18,4],[22,3,22,28],[0,1,0,37],[3,3,3,35],[5,34,5,35],[8,3,8,27],[8,28,8,35],[18,17,18,18],[17,19,17,35],[18,7,18,8],[18,9,18,10],[69,4,69,35],[16,3,16,18],[131,8,131,14],[127,16,127,17],[46,3,46,35],[60,4,60,35],[62,4,63,35],[74,4,74,35],[85,19,85,20],[20,3,20,35],[126,13,126,14],[22,29,22,35],[71,4,72,35],[24,3,24,28],[85,16,85,17],[85,7,85,8],[85,10,85,11],[85,13,85,14],[84,22,84,26],[65,4,65,35],[24,29,24,35],[35,3,35,35],[76,3,82,5],[84,3,84,21],[127,7,127,8],[127,10,127,11],[127,13,127,14],[126,3,126,5],[126,7,126,8],[126,10,126,11],[126,19,126,20],[126,22,126,26],[126,28,126,34],[126,16,126,17],[113,37,116,37],[114,20,116,30],[117,37,119,37],[118,20,122,30],[121,37,123,37],[139,37,141,37],[133,29,133,30],[133,32,133,34],[135,26,135,28],[133,25,133,27],[127,19,127,20],[182,27,182,31],[174,23,174,25],[180,27,180,31],[136,8,136,14],[173,19,173,21],[139,3,141,16],[139,17,141,19],[139,20,141,30],[173,23,173,25],[173,29,173,33],[174,7,174,9],[174,11,174,13],[174,15,174,17],[174,19,174,21],[173,15,173,17],[133,8,133,14],[173,7,173,9],[173,11,173,13],[184,27,184,31],[187,9,187,11],[187,15,187,17],[187,21,187,23],[187,27,187,31],[188,9,188,11],[188,15,188,17],[188,21,188,23],[192,27,192,31],[200,9,200,11],[200,15,200,17],[200,21,200,23],[194,27,194,31],[196,27,196,31],[199,9,199,11],[199,15,199,17],[199,21,199,23],[199,27,199,31],[203,27,203,31],[203,9,203,11],[203,15,203,17],[203,21,203,23],[204,21,204,23],[210,7,210,11],[210,15,210,17],[204,9,204,11],[204,15,204,17],[213,27,216,34],[215,3,215,7],[215,17,216,26],[211,15,211,17],[211,21,211,23],[209,27,211,34],[210,21,210,23],[213,3,213,15],[213,17,214,19],[211,7,211,11]]}
[]
[]
[]
[null,null,null,"SEGURO AMBIENTAL DE INCIDENCIA COLECTIVA AUTODETERMINACIÓN DEL MONTO MÍNIMO DE ENTIDAD SUFICIENTE (MMES)"]
[]
[null,null,null,"Datos Generales",null,null,null,null,null,null,null,null,null,null,null,null,null,null,null,null,null,null,null,null,null,null,null,null,null,null,null,null,null,null,"Rev. 10"]
[]
[null,null,null,"Razón Social (*)",null,null,null,null,null,null,null,null,null,null,null,null,null,null,null,null,null,null,null,null,null,null,null,null,"Fecha (*)"]
[null,null,null,null,null,null,null,null,null,null,null,null,null,null,null,null,null,null,null,null,null,null,null,null,null,null,null,null,"2017-06-01"]
[null,null,null,"Denominación de la Planta (*)",null,null,null,null,null,null,null,null,null,null,null,null,null,null,null,null,null,null,null,null,null,null,null,null,"CUIT (*)"]
[null,null,null,null,null,null,null,null,null,null,null,null,null,null,null,null,null,null,null,null,null,null,null,null,null,null,null,null,0]
[null,null,null,"Domicilio - Localidad - Provincia -UBICACIÓN DEL RIESGO- (*)"]
[]
[null,null,null,"Teléfono(s) (*)",null,null,null,null,null,null,null,null,null,null,null,null,null,null,null,"Página web",null,null,null,null,null,null,null,null,null,null,null,null,null,null,null,"campo opcional"]
[]
[null,null,null,"e-mail (*)",null,null,null,null,null,null,null,null,null,null,null,null,null,null,null,"Organismo Solicitante del Seguro (*)"]
[null,null,null,null,null,null,null,null,null,null,null,null,null,null,null,null,null,null,null,null,null,null,null,null,null,null,null,null,null,null,null,null,null,null,null,null,null,null,1,{"$f":"+IF(AM17=1,1,IF(AM17=6,IF(T19=0,1,0),0))","v":1},{"$f":"+IF(AM17=6,IF(T19=0,1,0),0)","v":0}]
[null,null,null,"Coordenadas geográficas (*)",null,null,null,null,null,null,null,null,null,null,null,null,null,null,null,{"$f":"+IF(AM17=6,IF(T19=0,\"Organismo Solicitante del Seguro\",0),0)","v":0}]
[null,null,null,null,null,null,null,null,null,"Lat. Sur",null,null,null,null,null,null,null,"Long. O"]
[null,null,null,"Persona(s) de contacto (*)"]
[]
[null,null,null,"Responsable Técnico (*)",null,null,null,null,null,null,null,null,null,null,null,null,null,null,null,null,null,null,null,null,null,null,null,null,null,"DNI (*)"]
[]
[null,null,null,"Responsable Medio Ambiente",null,null,null,null,null,null,null,null,null,null,null,null,null,null,null,null,null,null,null,null,null,null,null,null,"campo opcional","DNI",null,null,null,null,null,"campo opcional"]
[]
[]
[null,null,null,"Relevamiento Documental "]
[]
[]
[]
[]
[null,null,null,"Rubro Complementario según RES. 481/2011 - sólo para Rubros Principales = 999999",null,null,null,null,null,null,null,null,null,null,null,null,null,null,null,null,null,null,null,null,null,null,null,null,null,null,null,null,null,null,null,{"$f":"IF(Ru!E2=1,0,IF(Ru!E2<160,\"NO realizar opción de la siguiente ventana para el Rubro principal seleccionado\",\"DEBE realizar una selección adicional de la siguiente ventana de acuerdo a la RES. 481/2011\"))","v":"NO realizar opción de la siguiente ventana para el Rubro principal seleccionado"},null,null,{"$f":"+Ru!E2","v":2},{"$f":"+IF(AM32>=160,IF(AM33>1,1,0))","v":false}]
[null,null,null,null,null,null,null,null,null,null,null,null,null,null,null,null,null,null,null,null,null,null,null,null,null,null,null,null,null,null,null,null,null,null,null,null,null,null,{"$f":"+Ru!E163","v":2}]
[]
[]
[null,null,null,{"$f":"+IF(AM32<160,IF(AM33>1,\"NO CORRESPONDE LA SELECCIÓN SEGÚN RES. 481/2011\",\"  \"),VLOOKUP(AM33,Ru!$A$165:$G$177,7,0))","v":"NO CORRESPONDE LA SELECCIÓN SEGÚN RES. 481/2011"}]
[]
[null,null,null,"Tipos de desechos (*)"]
[null,null,null,null,null,null,null,null,null,null,null,null,null,null,null,null,null,null,null,null,null,null,null,null,null,null,null,null,null,null,null,null,null,0]
[]
{"$rows_left_out":181}
{"sheet":"Desechos","index":1,"n_rows":47,"n_cols":1,"rows_kept":47,"cut":false,"hidden":true,"merged":[]}
["DESCRIPCION"]
["Y1 - Desechos clínicos resultantes de la atención médica prestada en hospitales, centros médicos y clínicas para salud humana y animal."]
["Y2 - Desechos resultantes de la producción y preparación de productos farmacéuticos."]
["Y3 - Desechos de medicamentos y productos farmacéuticos para la salud humana y animal."]
["Y4 - Desechos resultantes de la producción, la preparación y utilización de biocidas y productos fitosanitarios."]
["Y5 - Desechos resultantes de la fabricación, preparación y utilización de productos químicos para la preservación de la madera."]
["Y6 - Desechos resultantes de la producción, la preparación y la utilización de disolventes orgánicos."]
["Y7 - Desechos que contengan cianuros, resultantes del tratamiento térmico y las operaciones de temple."]
["Y8 - Desechos de aceites minerales no aptos para el uso a que estaban destinados."]
["Y9 - Mezclas y emulsiones de desecho de aceite y agua o de hidrocarburos y agua."]
["Y10 -  Sustancias y artículos de desecho que contengan o estén contaminados por bifenilos policlorados (PCB), trifenilos policlorados (PCT) o bifenilos polibromados (PBB)."]
["Y11 -  Residuos alquitranados resultantes de la refinación, destilación o cualquier otro tratamiento pirolítico."]
["Y12 -  Desechos resultantes de la producción, preparación y utilización de tintas, colorantes, pigmentos, pinturas, lacas o barnices."]
["Y13 -  Desechos resultantes de la producción, preparación y utilización de resinas, látex, plastificantes o colas y adhesivos."]
["Y14 -  Sustancias químicas de desecho, no identificadas o nuevas, resultantes de la investigación y el desarrollo o de las actividades de enseñanza y cuyos efectos en el ser humano o el medio ambiente no se conozcan."]
["Y15 -  Desechos de carácter explosivo que no estén sometidos a una legislación diferente."]
["Y16 -  Desechos resultantes de la producción, preparación y utilización de productos químicos y materiales para fines fotográficos."]
["Y17 -  Desechos resultantes del tratamiento de superficies de metales y plásticos."]
["Y18 -  Residuos resultantes de las operaciones de eliminación de desechos industriales."]
["Y19 -  Metales carbonilos."]
["Y20 -  Berilio, compuesto de berilio."]
["Y21 -  Compuestos de cromo hexavalente."]
["Y22 -  Compuestos de cobre."]
["Y23 -  Compuestos de zinc."]
["Y24 -  Arsénico, compuestos de arsénico."]
["Y25 -  Selenio, compuestos de selenio."]
["Y26 -  Cadmio, compuestos de cadmio."]
["Y27 -  Antimonio, compuestos de antimonio."]
["Y28 -  Telurio, compuestos de telurio."]
["Y29 -  Mercurio, compuestos de mercurio."]
["Y30 -  Talio, compuestos de talio."]
["Y31 -  Plomo, compuestos de plomo."]
["Y32 -  Compuestos inorgánicos de flúor, con exclusión de fluoruro cálcico."]
["Y33 -  Cianuros inorgánicos."]
["Y34 -  Soluciones ácidas o ácidos en forma sólida."]
["Y35 -  Soluciones básicas o bases en forma sólida."]
["Y36 -  Asbestos (polvo y fibras)."]
["Y37 -  Compuestos orgánicos de fósforo."]
["Y38 -  Cianuros orgánicos."]
["Y39 -  Fenoles, compuestos fenólicos, con inclusión de clorofenoles."]
{"$rows_left_out":8}
{"sheet":"Desarrollo","index":2,"n_rows":71,"n_cols":33,"rows_kept":71,"cut":false,"hidden":true,"merged":[[10,1,10,2],[10,13,10,14],[2,1,2,25],[2,26,2,33],[4,1,4,25],[4,26,4,33],[6,1,6,33],[8,1,8,2],[8,32,8,33],[18,32,18,33],[18,1,18,2],[18,5,18,6],[11,1,11,2],[16,1,16,6],[11,32,11,33],[13,1,13,2],[13,32,13,33],[15,1,15,6],[15,13,15,14],[26,17,26,18],[26,1,26,3],[26,5,26,6],[16,13,16,14],[17,1,17,10],[17,13,17,14],[20,1,20,6],[20,13,20,14],[21,1,21,10],[26,8,26,9],[26,11,26,12],[21,13,21,14],[22,1,22,2],[26,14,26,15],[24,17,24,18],[22,5,22,6],[30,14,30,15],[30,17,30,18],[28,1,28,3],[28,30,28,33],[30,8,30,9],[30,11,30,13],[30,1,30,3],[30,5,30,6],[36,1,36,3],[36,5,36,8],[38,1,38,3],[38,5,38,8],[22,32,22,33],[24,1,24,3],[24,5,24,6],[24,8,24,9],[24,11,24,12],[24,14,24,15],[40,1,40,3],[40,30,40,33],[32,14,32,15],[32,17,32,18],[32,1,32,3],[32,5,32,6],[32,8,32,9],[32,11,32,12],[34,1,34,3],[34,30,34,33],[44,11,44,13],[48,7,48,9],[44,15,44,17],[44,19,44,21],[46,1,46,3],[46,30,46,33],[58,30,58,33],[50,19,50,21],[48,1,48,3],[44,23,44,25],[42,7,42,9],[42,11,42,13],[42,15,42,17],[42,19,42,21],[42,23,42,25],[44,7,44,9],[56,1,56,3],[56,7,56,9],[56,13,56,15],[56,19,56,21],[48,13,48,15],[50,7,50,9],[50,13,50,15],[52,1,52,3],[48,19,48,21],[50,1,50,3],[52,30,52,33],[60,1,60,3],[60,7,60,9],[54,13,54,15],[54,19,54,21],[54,1,54,3],[60,19,60,21],[58,1,58,3],[54,7,54,9],[70,29,70,33],[64,1,64,3],[64,30,64,33],[66,5,66,9],[66,13,66,15],[66,19,66,21],[68,5,68,9],[68,13,68,15],[60,13,60,15],[68,19,68,21],[70,1,70,3],[62,1,62,3],[62,7,62,9],[62,13,62,15],[62,19,62,21]]}
[]
[null,"Razón Social (*)",null,null,null,null,null,null,null,null,null,null,null,null,null,null,null,null,null,null,null,null,null,null,null,null,"Fecha (*)"]
[null,{"$f":"+MMES!D9","v":0},null,null,null,null,null,null,null,null,null,null,null,null,null,null,null,null,null,null,null,null,null,null,null,null,{"$f":"+MMES!AC9","v":"2017-06-01"}]
[null,"Denominación de la Planta (*)",null,null,null,null,null,null,null,null,null,null,null,null,null,null,null,null,null,null,null,null,null,null,null,null,"CUIT (*)"]
[null,{"$f":"+MMES!D11","v":0},null,null,null,null,null,null,null,null,null,null,null,null,null,null,null,null,null,null,null,null,null,null,null,null,{"$f":"+MMES!AC11","v":0}]
[null,"Domicilio - Localidad - Provincia -UBICACIÓN DEL RIESGO- (*)"]
[null,{"$f":"+MMES!D13","v":0}]
[]
[null,"Ru",null,null,"=",null,null,null,null,null,null,null,null,null,null,null,null,null,null,null,null,null,null,null,null,null,null,null,null,null,null,null,{"$f":"+MMES!H127","v":5}]
[]
[null,"Tipo",null,null,null,null,null,null,null,null,null,null,"=",{"$f":"+MMES!W85","v":1}]
[null,"ER",null,null,"=",null,null,null,null,null,null,null,null,null,null,null,null,null,null,null,null,null,null,null,null,null,null,null,null,null,null,null,{"$f":"+MMES!K127","v":1}]
[]
[null,"Ri",null,null,"=",null,null,null,null,null,null,null,null,null,null,null,null,null,null,null,null,null,null,null,null,null,null,null,null,null,null,null,{"$f":"+MMES!N127","v":1}]
[]
[null,"Cantidad de Personal",null,null,null,null,null,null,null,null,null,null,"=",{"$f":"+MMES!AR95","v":3}]
[null,"Potencia Instalada",null,null,null,null,null,null,null,null,null,null,"=",{"$f":"+MMES!AO107","v":2}]
[null,"Relación Sup. cubierta / Sup. total",null,null,null,null,null,null,null,null,null,null,"=",{"$f":"+MMES!AO117","v":0}]
[null,"Di",null,null,"=",null,null,null,null,null,null,null,null,null,null,null,null,null,null,null,null,null,null,null,null,null,null,null,null,null,null,null,{"$f":"+MMES!Q127","v":5}]
[]
[null,"Zona",null,null,null,null,null,null,null,null,null,null,"=",{"$f":"+MMES!AR107","v":2}]
[null,"Servicios Corrientes",null,null,null,null,null,null,null,null,null,null,"=",{"$f":"+MMES!AR117","v":0}]
[null,"Lo",null,null,"=",null,null,null,null,null,null,null,null,null,null,null,null,null,null,null,null,null,null,null,null,null,null,null,null,null,null,null,{"$f":"+MMES!T127","v":2}]
[]
[null,"NCAi",null,null,"=","Ru",null,"+","ER",null,"+","Ri",null,"+","Di",null,"+","Lo"]
[]
[null,"NCAi",null,null,"=",{"$f":"+MMES!H127","v":5},null,"+",{"$f":"+MMES!K127","v":1},null,"+",{"$f":"+MMES!N127","v":1},null,"+",{"$f":"+MMES!Q127","v":5},null,"+",{"$f":"+MMES!T127","v":2}]
[]
[null,"NCAi",null,null,"=",null,null,null,null,null,null,null,null,null,null,null,null,null,null,null,null,null,null,null,null,null,null,null,null,null,{"$f":"+F27+I27+L27+O27+R27","v":14}]
[]
[null,"NCA",null,null,"=","NCAi",null,"+","AjSP",null,"-","AjSGA"]
[]
[null,"NCA",null,null,"=",{"$f":"+MMES!W127","v":14},null,"+",{"$f":"+MMES!AD134","v":2},null,"-",{"$f":"+MMES!AG134","v":4}]
[]
[null,"NCA",null,null,"=",null,null,null,null,null,null,null,null,null,null,null,null,null,null,null,null,null,null,null,null,null,null,null,null,null,{"$f":"+MMES!AA136","v":12}]
[]
[null,"FC",null,null,"=",{"$f":"+MMES!I132","v":1967}]
[]
[null,"Ajuste",null,null,"=",{"$f":"+MMES!I134","v":1.5}]
[]
{"$rows_left_out":32}
{"sheet":"Recomendacion","index":3,"n_rows":47,"n_cols":27,"rows_kept":47,"cut":false,"hidden":true,"merged":[[8,1,8,33],[1,1,1,33],[4,1,4,25],[4,26,4,33],[6,1,6,25],[6,26,6,33],[10,1,10,8],[10,13,10,20],[10,26,10,33],[11,1,11,8],[11,13,11,20],[11,26,11,33],[12,26,12,33],[15,1,15,33],[16,1,16,33],[20,1,20,16],[20,18,20,33],[19,1,19,16],[19,18,19,33],[12,1,12,8],[12,13,12,20],[23,1,23,16],[23,18,23,33],[24,1,24,16],[24,18,24,33],[21,1,21,16],[21,18,21,33],[22,1,22,16],[22,18,22,33],[27,1,27,16],[27,18,27,33],[28,1,28,16],[28,18,28,33],[25,1,25,16],[25,18,25,33],[26,1,26,16],[26,18,26,33],[31,1,31,16],[31,18,31,33],[32,1,32,16],[32,18,32,33],[29,1,29,16],[29,18,29,33],[30,1,30,16],[30,18,30,33],[36,18,36,33],[37,1,37,16],[33,1,33,16],[33,18,33,33],[34,1,34,16],[34,18,34,33],[37,18,37,33],[45,1,45,16],[35,1,35,16],[35,18,35,33],[46,18,46,33],[38,1,38,16],[38,18,38,33],[39,1,39,16],[39,18,39,33],[36,1,36,16]]}
[]
[null,"RECOMENDACIÓN"]
[]
[null,"Razón Social (*)",null,null,null,null,null,null,null,null,null,null,null,null,null,null,null,null,null,null,null,null,null,null,null,null,"Fecha (*)"]
[null,{"$f":"+MMES!D9","v":0},null,null,null,null,null,null,null,null,null,null,null,null,null,null,null,null,null,null,null,null,null,null,null,null,{"$f":"+MMES!AC9","v":"2017-06-01"}]
[null,"Denominación de la Planta (*)",null,null,null,null,null,null,null,null,null,null,null,null,null,null,null,null,null,null,null,null,null,null,null,null,"CUIT (*)"]
[null,{"$f":"+MMES!D11","v":0},null,null,null,null,null,null,null,null,null,null,null,null,null,null,null,null,null,null,null,null,null,null,null,null,{"$f":"+MMES!AC11","v":0}]
[null,"Domicilio - Localidad - Provincia -UBICACIÓN DEL RIESGO- (*)"]
[null,{"$f":"+MMES!D13","v":0}]
[]
[null,"MMES DETERMINADO POR EL",null,null,null,null,null,null,null,null,null,null,null,"MMES DETERMINADO POR LA",null,null,null,null,null,null,null,null,null,null,null,null,"MMES DETERMINADO POR"]
[null,"TOMADOR",null,null,null,null,null,null,null,null,null,null,null,"ASEGURADORA",null,null,null,null,null,null,null,null,null,null,null,null,"KOMALIA S.A."]
[null,null,null,null,null,null,null,null,null,null,null,null,null,null,null,null,null,null,null,null,null,null,null,null,null,null,{"$f":"+MMES!AB214","v":4115996.1421666495}]
[]
[null,"JUSTIFICACIÓN"]
[]
[]
[]
[null,"DOCUMENTACIÓN PENDIENTE DE ENTREGA"]
[]
[]
[]
[]
[]
[]
[]
[]
[]
[]
[]
[]
[]
[]
[]
[]
[]
[]
[]
[]
[]
{"$rows_left_out":8}
{"sheet":"Ru","index":4,"n_rows":177,"n_cols":9,"rows_kept":177,"cut":false,"hidden":true,"merged":[]}
[1,"SELECCIONAR RUBRO PRINCIPAL",null,null,null,null,null,null,"SELECCIONAR"]
[2,"101000 - Extracción y aglomeración de carbón",2,5,2,{"$f":"+IF(E2>=160,VLOOKUP(E163,$A$165:$D$177,4),VLOOKUP(E2,$A$1:$D$162,4))","v":5},null,null,"SAyDS - Secretaría de Ambiente y Desarrollo Sustentable de la Nación"]
[3,"102000 - Extracción y aglomeración de lignito",2,5,null,null,null,null,"OPDS - Organismo Provincial para el Desarrollo Sostenible - Pcia. Bs. As."]
[4,"103000 - Extracción y aglomeración de turba",1,1,null,null,null,null,"ACUMAR - Autoridad de Cuenca Matanza Riachuelo"]
[5,"111000 - Extracción de petróleo crudo y gas natural",3,10,null,null,null,null,"APRA - Agencia de Protección Ambiental - C.A.B.A."]
[6,"112000 - Actividades de servicios relacionadas con la extracción de petróleo y gas, excepto las actividades de prospección",2,5,null,null,null,null,"Otro: detallar debajo"]
[7,"120000 - Extracción de minerales y concentrados de uranio y torio",3,10,null,null,null,null,"NINGUNO"]
[8,"131000 - Extracción de minerales de hierro",3,10]
[9,"132000 - Extracción de minerales metalíferos no ferrosos, excepto minerales de uranio y torio",3,10]
[10,"141100 - Extracción de rocas ornamentales",1,1]
[11,"141200 - Extracción de piedra caliza y yeso",1,1]
[12,"141300 - Extracción de arenas, canto rodado y triturados pétreos",1,1]
[13,"141400 - Extracción de arcilla y caolín",1,1]
[14,"142110 - Extracción de minerales para la fabricación de abonos excepto turba.",1,1]
[15,"142120 - Extracción de minerales para la fabricación de productos químicos",1,1]
[16,"142200 - Extracción de sal en salinas y de roca",1,1]
[17,"142900 - Explotación de minas y canteras n.c.p.",1,1]
[18,"151111 - Matanza de ganado bovino ",1,1]
[19,"151112 - Procesamiento de carne de ganado bovino",1,1]
[20,"151113 - Saladero y peladero de cueros de ganado bovino",1,1]
[21,"154200 - Elaboración de azúcar",2,5]
[22,"155110 - Destilación de alcohol etílico",2,5]
[23,"155120 - Destilación, rectificación y mezcla de bebidas espiritosas",2,5]
[24,"171120 - Preparación de fibras animales de uso textil, incluso lavado de lana",1,1]
[25,"171200 - Acabado de productos textiles",2,5]
[26,"191100 - Curtido y terminación de cueros",3,10]
[27,"201000 - Aserrado y cepillado de madera",2,5]
[28,"202100 - Fabricación de hojas de madera para enchapado; fabricación de tableros contrachapados; tableros laminados; tableros de partículas y tableros y paneles n.c.p.",2,5]
[29,"210101 - Fabricación de pulpa de madera",3,10]
[30,"210102 - Fabricación de papel y cartón excepto envases",2,5]
[31,"231000 - Fabricación de productos de hornos de coque",3,10]
[32,"232000 - Fabricación de productos de la refinación del petróleo",3,10]
[33,"241110 - Fabricación de gases comprimidos y licuados.",3,10]
[34,"241120 - Fabricación de curtientes naturales y sintéticos.",3,10]
[35,"241130 - Fabricación de materias colorantes básicas, excepto pigmentos preparados.",2,5]
[36,"241180 - Fabricación de materias químicas inorgánicas básicas n.c.p.",3,10]
[37,"241190 - Fabricación de materias químicas orgánicas básicas n.c.p.",3,10]
[38,"241200 - Fabricación de abonos y compuestos de nitrógeno",1,1]
[39,"241301 - Fabricación de resinas y cauchos sintéticos",3,10]
[40,"241309 - Fabricación de materias plásticas en formas primarias n.c.p.",3,10]
{"$rows_left_out":138}
{"sheet":"TIPO","index":5,"n_rows":97,"n_cols":6,"rows_kept":97,"cut":false,"hidden":true,"merged":[]}
["G","L","S",null,"GLS","Nº"]
[0,0,0,null,{"$f":"+A2&B2&C2","v":"000"},0]
[0,0,"S0",null,"00S0",0]
[0,0,"S1",null,"00S1",1]
[0,0,"S2",null,"00S2",2]
[0,0,"S3",null,"00S3",3]
[0,0,"S4",null,"00S4",4]
[0,"L0",0,null,"0L00",0]
[0,"L0","S0",null,"0L0S0",0]
[0,"L0","S1",null,"0L0S1",1]
[0,"L0","S2",null,"0L0S2",2]
[0,"L0","S3",null,"0L0S3",3]
[0,"L0","S4",null,"0L0S4",4]
[0,"L1",0,null,"0L10",1]
[0,"L1","S0",null,"0L1S0",1]
[0,"L1","S1",null,"0L1S1",1]
[0,"L1","S2",null,"0L1S2",2]
[0,"L1","S3",null,"0L1S3",3]
[0,"L1","S4",null,"0L1S4",4]
[0,"L2",0,null,"0L20",3]
[0,"L2","S0",null,"0L2S0",3]
[0,"L2","S1",null,"0L2S1",3]
[0,"L2","S2",null,"0L2S2",3]
[0,"L2","S3",null,"0L2S3",3]
[0,"L2","S4",null,"0L2S4",4]
["G0",0,0,null,"G000",0]
["G0",0,"S0",null,"G00S0",0]
["G0",0,"S1",null,"G00S1",1]
["G0",0,"S2",null,"G00S2",2]
["G0",0,"S3",null,"G00S3",3]
["G0",0,"S4",null,"G00S4",4]
["G0","L0",0,null,"G0L00",0]
["G0","L0","S0",null,"G0L0S0",0]
["G0","L0","S1",null,{"$f":"+A34&B34&C34","v":"G0L0S1"},1]
["G0","L0","S2",null,"G0L0S2",2]
["G0","L0","S3",null,"G0L0S3",3]
["G0","L0","S4",null,"G0L0S4",4]
["G0","L1",0,null,"G0L10",1]
["G0","L1","S0",null,"G0L1S0",1]
["G0","L1","S1",null,"G0L1S1",1]
{"$rows_left_out":58}
{"sheet":"Hoja1","index":6,"n_rows":0,"n_cols":0,"rows_kept":0,"cut":false,"hidden":true,"merged":[]}